Reaction Details
TargetCannabinoid receptor 1
LigandBDBM50208957
Substrate/Competitorn/a
Meas. Tech.ChEMBL_438557 (CHEMBL887658)
Ki 620±n/a nM
Citation Smith, RAFathi, ZAchebe, FAkuche, CBrown, SEChoi, SFan, JJenkins, SKluender, HCKonkar, ALavoie, RMays, RNatoli, JO'Connor, SJOrtiz, AASu, NTaing, CTomlinson, STritto, TWang, GWirtz, SNWong, WYang, XFYing, SZhang, Z Optimization of imidazole amide derivatives as cannabinoid-1 receptor antagonists for the treatment of obesity. Bioorg Med Chem Lett17:2706-11 (2007) 
 
Cannabinoid receptor 1
Name:Cannabinoid receptor 1
Type:G Protein-Coupled Receptor (GPCR)
Mol. Mass.:52868.96
Organism:Homo sapiens (Human)
Description:P21554
Residue:472
BDBM50208957
NameBDBM50208957
Synonyms:1-(4-chlorophenyl)-2-(2,4-dichlorophenyl)-N-((1S,2S)-2-(methylamino)cyclohexyl)-1H-imidazole-4-carboxamide | CHEMBL229859
TypeSmall organic molecule
Emp. Form.C23H23Cl3N4O
Mol. Mass.477.814
SMILESCN[C@H]1CCCC[C@@H]1NC(=O)c1cn(c(n1)-c1ccc(Cl)cc1Cl)-c1ccc(Cl)cc1