Reaction Details
TargetCannabinoid receptor 2
LigandBDBM50208961
Substrate/Competitorn/a
Meas. Tech.ChEMBL_438558 (CHEMBL887659)
Ki>1000±n/a nM
Citation Smith, RAFathi, ZAchebe, FAkuche, CBrown, SEChoi, SFan, JJenkins, SKluender, HCKonkar, ALavoie, RMays, RNatoli, JO'Connor, SJOrtiz, AASu, NTaing, CTomlinson, STritto, TWang, GWirtz, SNWong, WYang, XFYing, SZhang, Z Optimization of imidazole amide derivatives as cannabinoid-1 receptor antagonists for the treatment of obesity. Bioorg Med Chem Lett17:2706-11 (2007) 
 
Cannabinoid receptor 2
Name:Cannabinoid receptor 2
Type:G Protein-Coupled Receptor (GPCR)
Mol. Mass.:39690.94
Organism:Homo sapiens (Human)
Description:P34972
Residue:360
BDBM50208961
NameBDBM50208961
Synonyms:1-(4-chlorophenyl)-N-cyclohexyl-2-o-tolyl-1H-imidazole-4-carboxamide | CHEMBL439375
TypeSmall organic molecule
Emp. Form.C23H24ClN3O
Mol. Mass.393.909
SMILESCc1ccccc1-c1nc(cn1-c1ccc(Cl)cc1)C(=O)NC1CCCCC1