Reaction Details
TargetCannabinoid receptor 1
LigandBDBM21278
Substrate/Competitorn/a
Meas. Tech.ChEMBL_438557 (CHEMBL887658)
Ki 1.1±n/a nM
Citation Smith, RAFathi, ZAchebe, FAkuche, CBrown, SEChoi, SFan, JJenkins, SKluender, HCKonkar, ALavoie, RMays, RNatoli, JO'Connor, SJOrtiz, AASu, NTaing, CTomlinson, STritto, TWang, GWirtz, SNWong, WYang, XFYing, SZhang, Z Optimization of imidazole amide derivatives as cannabinoid-1 receptor antagonists for the treatment of obesity. Bioorg Med Chem Lett17:2706-11 (2007) 
 
Cannabinoid receptor 1
Name:Cannabinoid receptor 1
Type:G Protein-Coupled Receptor (GPCR)
Mol. Mass.:52868.96
Organism:Homo sapiens (Human)
Description:P21554
Residue:472
BDBM21278
NameBDBM21278
Synonyms:5-(4-chlorophenyl)-1-(2,4-dichlorophenyl)-4-methyl-N-(piperidin-1-yl)-1H-pyrazole-3-carboxamide CHEMBL111 RIMONABANT HYDROCHLORIDE SR 141716A SR141716A [3H]SR141716A
TypeSmall organic molecule
Emp. Form.C22H21Cl3N4O
Mol. Mass.463.787
SMILESCc1c(nn(c1-c1ccc(Cl)cc1)-c1ccc(Cl)cc1Cl)C(=O)NN1CCCCC1