Reaction Details
TargetCannabinoid receptor 1
LigandBDBM50208964
Substrate/Competitorn/a
Meas. Tech.ChEMBL_438557 (CHEMBL887658)
Ki 19±n/a nM
Citation Smith, RAFathi, ZAchebe, FAkuche, CBrown, SEChoi, SFan, JJenkins, SKluender, HCKonkar, ALavoie, RMays, RNatoli, JO'Connor, SJOrtiz, AASu, NTaing, CTomlinson, STritto, TWang, GWirtz, SNWong, WYang, XFYing, SZhang, Z Optimization of imidazole amide derivatives as cannabinoid-1 receptor antagonists for the treatment of obesity. Bioorg Med Chem Lett17:2706-11 (2007) 
 
Cannabinoid receptor 1
Name:Cannabinoid receptor 1
Type:G Protein-Coupled Receptor (GPCR)
Mol. Mass.:52868.96
Organism:Homo sapiens (Human)
Description:P21554
Residue:472
BDBM50208964
NameBDBM50208964
Synonyms:5-bromo-2-(2-chlorophenyl)-1-(4-chlorophenyl)-N-((1S,2S)-2-hydroxycyclohexyl)-1H-imidazole-4-carboxamide | CHEMBL396739
TypeSmall organic molecule
Emp. Form.C22H20BrCl2N3O2
Mol. Mass.509.223
SMILESO[C@H]1CCCC[C@@H]1NC(=O)c1nc(-c2ccccc2Cl)n(c1Br)-c1ccc(Cl)cc1