Reaction Details
TargetCannabinoid receptor 2
LigandBDBM50208972
Substrate/Competitorn/a
Meas. Tech.ChEMBL_438558 (CHEMBL887659)
Ki 2700±n/a nM
Citation Smith, RAFathi, ZAchebe, FAkuche, CBrown, SEChoi, SFan, JJenkins, SKluender, HCKonkar, ALavoie, RMays, RNatoli, JO'Connor, SJOrtiz, AASu, NTaing, CTomlinson, STritto, TWang, GWirtz, SNWong, WYang, XFYing, SZhang, Z Optimization of imidazole amide derivatives as cannabinoid-1 receptor antagonists for the treatment of obesity. Bioorg Med Chem Lett17:2706-11 (2007) 
 
Cannabinoid receptor 2
Name:Cannabinoid receptor 2
Type:G Protein-Coupled Receptor (GPCR)
Mol. Mass.:39690.94
Organism:Homo sapiens (Human)
Description:P34972
Residue:360
BDBM50208972
NameBDBM50208972
Synonyms:2-(2-chlorophenyl)-1-(4-chlorophenyl)-N-((1S,2S)-2-hydroxycyclohexyl)-5-propyl-1H-imidazole-4-carboxamide | CHEMBL230801
TypeSmall organic molecule
Emp. Form.C25H27Cl2N3O2
Mol. Mass.472.407
SMILESCCCc1c(nc(-c2ccccc2Cl)n1-c1ccc(Cl)cc1)C(=O)N[C@H]1CCCC[C@@H]1O