Reaction Details
TargetCannabinoid receptor 1
LigandBDBM50208975
Substrate/Competitorn/a
Meas. Tech.ChEMBL_438557 (CHEMBL887658)
Ki 3.7±n/a nM
Citation Smith, RAFathi, ZAchebe, FAkuche, CBrown, SEChoi, SFan, JJenkins, SKluender, HCKonkar, ALavoie, RMays, RNatoli, JO'Connor, SJOrtiz, AASu, NTaing, CTomlinson, STritto, TWang, GWirtz, SNWong, WYang, XFYing, SZhang, Z Optimization of imidazole amide derivatives as cannabinoid-1 receptor antagonists for the treatment of obesity. Bioorg Med Chem Lett17:2706-11 (2007) 
 
Cannabinoid receptor 1
Name:Cannabinoid receptor 1
Type:G Protein-Coupled Receptor (GPCR)
Mol. Mass.:52868.96
Organism:Homo sapiens (Human)
Description:P21554
Residue:472
BDBM50208975
NameBDBM50208975
Synonyms:1-(4-bromophenyl)-2-(2-chlorophenyl)-5-ethyl-N-((1S,2S)-2-hydroxycyclohexyl)-1H-imidazole-4-carboxamide | CHEMBL231118
TypeSmall organic molecule
Emp. Form.C24H25BrClN3O2
Mol. Mass.502.831
SMILESCCc1c(nc(-c2ccccc2Cl)n1-c1ccc(Br)cc1)C(=O)N[C@H]1CCCC[C@@H]1O