Reaction Details
TargetCannabinoid receptor 2
LigandBDBM50208977
Substrate/Competitorn/a
Meas. Tech.ChEMBL_438558 (CHEMBL887659)
Ki 5300±n/a nM
Citation Smith, RAFathi, ZAchebe, FAkuche, CBrown, SEChoi, SFan, JJenkins, SKluender, HCKonkar, ALavoie, RMays, RNatoli, JO'Connor, SJOrtiz, AASu, NTaing, CTomlinson, STritto, TWang, GWirtz, SNWong, WYang, XFYing, SZhang, Z Optimization of imidazole amide derivatives as cannabinoid-1 receptor antagonists for the treatment of obesity. Bioorg Med Chem Lett17:2706-11 (2007) 
 
Cannabinoid receptor 2
Name:Cannabinoid receptor 2
Type:G Protein-Coupled Receptor (GPCR)
Mol. Mass.:39690.94
Organism:Homo sapiens (Human)
Description:P34972
Residue:360
BDBM50208977
NameBDBM50208977
Synonyms:2-(2-chlorophenyl)-1-(4-chlorophenyl)-N-((1S,2S)-2-hydroxycyclohexyl)-1H-imidazole-4-carboxamide | CHEMBL229914
TypeSmall organic molecule
Emp. Form.C22H21Cl2N3O2
Mol. Mass.430.327
SMILESO[C@H]1CCCC[C@@H]1NC(=O)c1cn(c(n1)-c1ccccc1Cl)-c1ccc(Cl)cc1