Reaction Details
TargetC-C chemokine receptor type 4
LigandBDBM50209250
Substrate/Competitorn/a
Meas. Tech.ChEMBL_455257 (CHEMBL906418)
Ki>10000±n/a nM
Citation Burdi, DFChi, SMattia, KHarrington, CShi, ZChen, SJacutin-Porte, SBennett, RCarson, KYin, WKansra, VGonzalo, JACoyle, AJaffee, BOcain, THodge, MLaRosa, GHarriman, G Small molecule antagonists of the CC chemokine receptor 4 (CCR4). Bioorg Med Chem Lett17:3141-5 (2007) 
 
C-C chemokine receptor type 4
Name:C-C chemokine receptor type 4
Type:Enzyme
Mol. Mass.:41406.41
Organism:Homo sapiens (Human)
Description:P51679
Residue:360
BDBM50209250
NameBDBM50209250
Synonyms:(S)-N-methyl-1-(naphthalen-2-ylsulfonyl)-N-(1-(phenylsulfonyl)piperidin-4-yl)pyrrolidine-2-carboxamide | CHEMBL246124
TypeSmall organic molecule
Emp. Form.C27H31N3O5S2
Mol. Mass.541.682
SMILESCN(C1CCN(CC1)S(=O)(=O)c1ccccc1)C(=O)[C@@H]1CCCN1S(=O)(=O)c1ccc2ccccc2c1