Reaction Details
TargetC-C chemokine receptor type 4
LigandBDBM50209256
Substrate/Competitorn/a
Meas. Tech.ChEMBL_455257 (CHEMBL906418)
Ki 10000±n/a nM
Citation Burdi, DFChi, SMattia, KHarrington, CShi, ZChen, SJacutin-Porte, SBennett, RCarson, KYin, WKansra, VGonzalo, JACoyle, AJaffee, BOcain, THodge, MLaRosa, GHarriman, G Small molecule antagonists of the CC chemokine receptor 4 (CCR4). Bioorg Med Chem Lett17:3141-5 (2007) 
 
C-C chemokine receptor type 4
Name:C-C chemokine receptor type 4
Type:Enzyme
Mol. Mass.:41406.41
Organism:Homo sapiens (Human)
Description:P51679
Residue:360
BDBM50209256
NameBDBM50209256
Synonyms:(S)-N-(1-benzylpiperidin-4-yl)-1-(4-isopropylphenylsulfonyl)pyrrolidine-2-carboxamide | CHEMBL428576
TypeSmall organic molecule
Emp. Form.C26H35N3O3S
Mol. Mass.469.639
SMILESCC(C)c1ccc(cc1)S(=O)(=O)N1CCC[C@H]1C(=O)NC1CCN(Cc2ccccc2)CC1