Reaction Details
TargetC-C chemokine receptor type 4
LigandBDBM50209268
Substrate/Competitorn/a
Meas. Tech.ChEMBL_455257 (CHEMBL906418)
Ki 590±n/a nM
Citation Burdi, DFChi, SMattia, KHarrington, CShi, ZChen, SJacutin-Porte, SBennett, RCarson, KYin, WKansra, VGonzalo, JACoyle, AJaffee, BOcain, THodge, MLaRosa, GHarriman, G Small molecule antagonists of the CC chemokine receptor 4 (CCR4). Bioorg Med Chem Lett17:3141-5 (2007) 
 
C-C chemokine receptor type 4
Name:C-C chemokine receptor type 4
Type:Enzyme
Mol. Mass.:41406.41
Organism:Homo sapiens (Human)
Description:P51679
Residue:360
BDBM50209268
NameBDBM50209268
Synonyms:(S)-N-methyl-1-(naphthalen-2-ylsulfonyl)-N-(1-phenethylpiperidin-4-yl)pyrrolidine-2-carboxamide | CHEMBL246986
TypeSmall organic molecule
Emp. Form.C29H35N3O3S
Mol. Mass.505.672
SMILESCN(C1CCN(CCc2ccccc2)CC1)C(=O)[C@@H]1CCCN1S(=O)(=O)c1ccc2ccccc2c1