Reaction Details
TargetPlasmepsin II
LigandBDBM50209552
Substrate/Competitorn/a
Meas. Tech.ChEMBL_438604 (CHEMBL887761)
Ki 3±n/a nM
Citation Hidaka, KKimura, TTsuchiya, YKamiya, MRuben, AJFreire, EHayashi, YKiso, Y Additional interaction of allophenylnorstatine-containing tripeptidomimetics with malarial aspartic protease plasmepsin II. Bioorg Med Chem Lett17:3048-52 (2007) 
 
Plasmepsin II
Name:Plasmepsin II
Type:Enzyme
Mol. Mass.:51482.09
Organism:Plasmodium falciparum
Description:P46925
Residue:453
BDBM50209552
NameBDBM50209552
Synonyms:(4R)-N-[(1S,2R)-2-hydroxy-2,3-dihydro-1H-inden-1-yl]-3-[(2S,3S)-2-hydroxy-3-({N-[(isoquinolin-5-yloxy)acetyl]-S-methyl-L-cysteinyl}amino)-4-phenylbutanoyl]-5,5-dimethyl-1,3-thiazolidine-4-carboxamide CHEMBL440965 | KNI-10033
TypeSmall organic molecule
Emp. Form.C40H45N5O7S2
Mol. Mass.771.945
SMILESCSC[C@H](NC(=O)COc1cccc2cnccc12)C(=O)N[C@@H](Cc1ccccc1)[C@H](O)C(=O)N1CSC(C)(C)[C@H]1C(=O)N[C@@H]1[C@H](O)Cc2ccccc12