Reaction Details
TargetPlasmepsin II
LigandBDBM50209560
Substrate/Competitorn/a
Meas. Tech.ChEMBL_438604 (CHEMBL887761)
Ki 12±n/a nM
Citation Hidaka, KKimura, TTsuchiya, YKamiya, MRuben, AJFreire, EHayashi, YKiso, Y Additional interaction of allophenylnorstatine-containing tripeptidomimetics with malarial aspartic protease plasmepsin II. Bioorg Med Chem Lett17:3048-52 (2007) 
 
Plasmepsin II
Name:Plasmepsin II
Type:Enzyme
Mol. Mass.:51482.09
Organism:Plasmodium falciparum
Description:P46925
Residue:453
BDBM50209560
NameBDBM50209560
Synonyms:(R)-3-((2S,3S)-3-((R)-2-(2-(3-aminophenyl)acetamido)-3-(methylthio)propanamido)-2-hydroxy-4-phenylbutanoyl)-N-((1S,2R)-2-hydroxy-2,3-dihydro-1H-inden-1-yl)-5,5-dimethylthiazolidine-4-carboxamide KNI-10368
TypeSmall organic molecule
Emp. Form.C37H45N5O6S2
Mol. Mass.719.913
SMILESCSC[C@H](NC(=O)Cc1cccc(N)c1)C(=O)N[C@@H](Cc1ccccc1)[C@H](O)C(=O)N1CSC(C)(C)[C@H]1C(=O)N[C@@H]1[C@H](O)Cc2ccccc12