Reaction Details
Target5-hydroxytryptamine receptor 1A
LigandBDBM78940
Substrate/Competitorn/a
Ki 8.7±n/a nM
CommentsPDSP_1219
Citation Lovenberg, TWBaron, BMde Lecea, LMiller, JDProsser, RARea, MAFoye, PERacke, MSlone, ALSiegel, BW A novel adenylyl cyclase-activating serotonin receptor (5-HT7) implicated in the regulation of mammalian circadian rhythms. Neuron11:449-58 (1993) 
 
5-hydroxytryptamine receptor 1A
Name:5-hydroxytryptamine receptor 1A
Type:G Protein-Coupled Receptor (GPCR)
Mol. Mass.:46445.29
Organism:Rattus norvegicus (rat)
Description:Binding assays were performed using rat hippocampal membranes.
Residue:422
BDBM78940
NameBDBM78940
Synonyms:METHIOTHEPIN Methiothepin mesylate salt cid_3039995 methanesulfonic acid;1-methyl-4-(3-methylsulfanyl-5,6-dihydrobenzo[b][1]benzothiepin-5-yl)piperazine | methanesulfonic acid;1-methyl-4-[3-(methylthio)-5,6-dihydrobenzo[b][1]benzothiepin-5-yl]piperazine
TypeSmall organic molecule
Emp. Form.C20H24N2S2
Mol. Mass.356.548
SMILESCSc1ccc2Sc3ccccc3CC(N3CCN(C)CC3)c2c1