Reaction Details
Target5-hydroxytryptamine receptor 7
LigandBDBM55121
Substrate/Competitorn/a
Ki 545±n/a nM
CommentsPDSP_728
Citation Lovenberg, TWBaron, BMde Lecea, LMiller, JDProsser, RARea, MAFoye, PERacke, MSlone, ALSiegel, BW A novel adenylyl cyclase-activating serotonin receptor (5-HT7) implicated in the regulation of mammalian circadian rhythms. Neuron11:449-58 (1993) 
 
5-hydroxytryptamine receptor 7
Name:5-hydroxytryptamine receptor 7
Type:G Protein-Coupled Receptor (GPCR)
Mol. Mass.:49852.62
Organism:Rattus norvegicus (rat)
Description:Rat cloned 5-HT7R.
Residue:448
BDBM55121
NameBDBM55121
Synonyms:3-HYDROXYTYRAMINE HYDROCHLORIDE 4-(2-aminoethyl)pyrocatechol;hydrochloride Dopamine SMR000059081 | cid_65340
TypeSmall organic molecule
Emp. Form.C8H11NO2
Mol. Mass.153.1784
SMILESNCCc1ccc(O)c(O)c1