Reaction Details
TargetB1 bradykinin receptor
LigandBDBM50209722
Substrate/Competitorn/a
Meas. Tech.ChEMBL_434361 (CHEMBL919420)
IC50 566.2±n/a nM
Citation Biswas, KLi, AChen, JJD'Amico, DCFotsch, CHan, NHuman, JLiu, QNorman, MHRiahi, BYuan, CSuzuki, HMareska, DAZhan, JClarke, DEToro, AGroneberg, RDBurgess, LELester-Zeiner, DBiddlecome, GManning, BHArik, LDong, HHuang, MKamassah, ALoeloff, RSun, HHsieh, FYKumar, GNg, GYHungate, RWAskew, BCJohnson, E Potent nonpeptide antagonists of the bradykinin B1 receptor: structure-activity relationship studies with novel diaminochroman carboxamides. J Med Chem50:2200-12 (2007) 
 
B1 bradykinin receptor
Name:B1 bradykinin receptor
Type:Enzyme
Mol. Mass.:40508.87
Organism:Homo sapiens (Human)
Description:P46663
Residue:353
BDBM50209722
NameBDBM50209722
Synonyms:(R)-N-((R)-7-((tert-butylamino)methyl)chroman-4-yl)-3-(4-cyanophenyl)-3-(3-(trifluoromethyl)phenylsulfonamido)-propanamide | CHEMBL389477
TypeSmall organic molecule
Emp. Form.C31H33F3N4O4S
Mol. Mass.614.678
SMILESCC(C)(C)NCc1ccc2[C@@H](CCOc2c1)NC(=O)C[C@@H](NS(=O)(=O)c1cccc(c1)C(F)(F)F)c1ccc(cc1)C#N