Reaction Details
TargetB1 bradykinin receptor
LigandBDBM50209740
Substrate/Competitorn/a
Meas. Tech.ChEMBL_434360 (CHEMBL919419)
Ki 5.9±n/a nM
Citation Biswas, KLi, AChen, JJD'Amico, DCFotsch, CHan, NHuman, JLiu, QNorman, MHRiahi, BYuan, CSuzuki, HMareska, DAZhan, JClarke, DEToro, AGroneberg, RDBurgess, LELester-Zeiner, DBiddlecome, GManning, BHArik, LDong, HHuang, MKamassah, ALoeloff, RSun, HHsieh, FYKumar, GNg, GYHungate, RWAskew, BCJohnson, E Potent nonpeptide antagonists of the bradykinin B1 receptor: structure-activity relationship studies with novel diaminochroman carboxamides. J Med Chem50:2200-12 (2007) 
 
B1 bradykinin receptor
Name:B1 bradykinin receptor
Type:Enzyme
Mol. Mass.:40508.87
Organism:Homo sapiens (Human)
Description:P46663
Residue:353
BDBM50209740
NameBDBM50209740
Synonyms:(R)-3-(4-fluorophenyl)-N-((R)-7-((isobutylamino)methyl)chroman-4-yl)-3-(3-(trifluoromethyl)phenylsulfonamido)-propanamide | CHEMBL389478
TypeSmall organic molecule
Emp. Form.C30H33F4N3O4S
Mol. Mass.607.659
SMILESCC(C)CNCc1ccc2[C@@H](CCOc2c1)NC(=O)C[C@@H](NS(=O)(=O)c1cccc(c1)C(F)(F)F)c1ccc(F)cc1