Reaction Details
TargetB1 bradykinin receptor
LigandBDBM50209726
Substrate/Competitorn/a
Meas. Tech.ChEMBL_434374 (CHEMBL919418)
IC50 1685±n/a nM
Citation Biswas, KLi, AChen, JJD'Amico, DCFotsch, CHan, NHuman, JLiu, QNorman, MHRiahi, BYuan, CSuzuki, HMareska, DAZhan, JClarke, DEToro, AGroneberg, RDBurgess, LELester-Zeiner, DBiddlecome, GManning, BHArik, LDong, HHuang, MKamassah, ALoeloff, RSun, HHsieh, FYKumar, GNg, GYHungate, RWAskew, BCJohnson, E Potent nonpeptide antagonists of the bradykinin B1 receptor: structure-activity relationship studies with novel diaminochroman carboxamides. J Med Chem50:2200-12 (2007) 
 
B1 bradykinin receptor
Name:B1 bradykinin receptor
Type:PROTEIN
Mol. Mass.:39519.62
Organism:Oryctolagus cuniculus
Description:ChEMBL_796432
Residue:352
BDBM50209726
NameBDBM50209726
Synonyms:(R)-3-(4-fluorophenyl)-N-((R)-7-((2-methoxyethylamino)methyl)chroman-4-yl)-3-(3-(trifluoromethyl)phenylsulfonamido)-propanamide | CHEMBL227870
TypeSmall organic molecule
Emp. Form.C29H31F4N3O5S
Mol. Mass.609.632
SMILESCOCCNCc1ccc2[C@@H](CCOc2c1)NC(=O)C[C@@H](NS(=O)(=O)c1cccc(c1)C(F)(F)F)c1ccc(F)cc1