Reaction Details
TargetC-C chemokine receptor type 3
LigandBDBM50209979
Substrate/Competitorn/a
Meas. Tech.ChEMBL_458974 (CHEMBL925069)
IC50 1.3±n/a nM
Citation Pruitt, JRBatt, DGWacker, DABostrom, LLBooker, SKMcLaughlin, EHoughton, GCVarnes, JGChrist, DDCovington, MDas, AMDavies, PGraden, DKariv, IOrlovsky, YStowell, NCVaddi, KGWadman, EAWelch, PKYeleswaram, SSolomon, KANewton, RCDecicco, CPCarter, PHKo, SS CC chemokine receptor-3 (CCR3) antagonists: improving the selectivity of DPC168 by reducing central ring lipophilicity. Bioorg Med Chem Lett17:2992-7 (2007) 
 
C-C chemokine receptor type 3
Name:C-C chemokine receptor type 3
Type:Enzyme
Mol. Mass.:41053.88
Organism:Homo sapiens (Human)
Description:P51677
Residue:355
BDBM50209979
NameBDBM50209979
Synonyms:1-((3R,4R)-3-(((S)-3-(4-fluorobenzyl)piperidin-1-yl)methyl)-1-(cyanomethyl)piperidin-4-yl)-3-(5-acetyl-4-methylthiazol-2-yl)urea | CHEMBL250437
TypeSmall organic molecule
Emp. Form.C27H35FN6O2S
Mol. Mass.526.669
SMILESCC(=O)c1sc(NC(=O)N[C@@H]2CCN(CC#N)C[C@H]2CN2CCC[C@@H](Cc3ccc(F)cc3)C2)nc1C