Reaction Details
TargetCytochrome P450 2D6
LigandBDBM50163636
Substrate/Competitorn/a
Meas. Tech.ChEMBL_458976 (CHEMBL925068)
IC50 240±n/a nM
Citation Pruitt, JRBatt, DGWacker, DABostrom, LLBooker, SKMcLaughlin, EHoughton, GCVarnes, JGChrist, DDCovington, MDas, AMDavies, PGraden, DKariv, IOrlovsky, YStowell, NCVaddi, KGWadman, EAWelch, PKYeleswaram, SSolomon, KANewton, RCDecicco, CPCarter, PHKo, SS CC chemokine receptor-3 (CCR3) antagonists: improving the selectivity of DPC168 by reducing central ring lipophilicity. Bioorg Med Chem Lett17:2992-7 (2007) 
 
Cytochrome P450 2D6
Name:Cytochrome P450 2D6
Type:Protein
Mol. Mass.:55774.82
Organism:Homo sapiens (Human)
Description:P10635
Residue:497
BDBM50163636
NameBDBM50163636
Synonyms:1-((1R,2S)-2-(((S)-3-(4-fluorobenzyl)piperidin-1-yl)methyl)cyclohexyl)-3-(5-acetyl-4-methylthiazol-2-yl)urea CHEMBL195433
TypeSmall organic molecule
Emp. Form.C26H35FN4O2S
Mol. Mass.486.645
SMILESCC(=O)c1sc(NC(=O)N[C@@H]2CCCC[C@H]2CN2CCC[C@@H](Cc3ccc(F)cc3)C2)nc1C