Reaction Details
TargetVascular endothelial growth factor receptor 2
LigandBDBM50210309
Substrate/Competitorn/a
Meas. Tech.ChEMBL_434528 (CHEMBL914744)
IC50 7±n/a nM
Citation Dinges, JAlbert, DHArnold, LDAshworth, KLAkritopoulou-Zanze, IBousquet, PFBouska, JJCunha, GADavidsen, SKDiaz, GJDjuric, SWGasiecki, AFGintant, GAGracias, VJHarris, CMHouseman, KAHutchins, CWJohnson, EFLi, HMarcotte, PAMartin, RLMichaelides, MRNyein, MSowin, TJSu, ZTapang, PHXia, ZZhang, HQ 1,4-Dihydroindeno[1,2-c]pyrazoles with acetylenic side chains as novel and potent multitargeted receptor tyrosine kinase inhibitors with low affinity for the hERG ion channel. J Med Chem50:2011-29 (2007) 
 
Vascular endothelial growth factor receptor 2
Name:Vascular endothelial growth factor receptor 2
Type:Receptor Tyrosine Kinase
Mol. Mass.:151510.97
Organism:Homo sapiens (Human)
Description:P35968
Residue:1356
BDBM50210309
NameBDBM50210309
Synonyms:4-methyl-1-((3-(5-(3-phenoxyprop-1-ynyl)thiophen-3-yl)-1,4-dihydroindeno[1,2-c]pyrazol-6-yl)methyl)piperazin-2-one | CHEMBL225334
TypeSmall organic molecule
Emp. Form.C29H26N4O2S
Mol. Mass.494.607
SMILESCN1CCN(Cc2ccc-3c(Cc4c-3n[nH]c4-c3csc(c3)C#CCOc3ccccc3)c2)C(=O)C1