Reaction Details
TargetVascular endothelial growth factor receptor 2
LigandBDBM50210300
Substrate/Competitorn/a
Meas. Tech.ChEMBL_434529 (CHEMBL914745)
IC50 5±n/a nM
Citation Dinges, JAlbert, DHArnold, LDAshworth, KLAkritopoulou-Zanze, IBousquet, PFBouska, JJCunha, GADavidsen, SKDiaz, GJDjuric, SWGasiecki, AFGintant, GAGracias, VJHarris, CMHouseman, KAHutchins, CWJohnson, EFLi, HMarcotte, PAMartin, RLMichaelides, MRNyein, MSowin, TJSu, ZTapang, PHXia, ZZhang, HQ 1,4-Dihydroindeno[1,2-c]pyrazoles with acetylenic side chains as novel and potent multitargeted receptor tyrosine kinase inhibitors with low affinity for the hERG ion channel. J Med Chem50:2011-29 (2007) 
 
Vascular endothelial growth factor receptor 2
Name:Vascular endothelial growth factor receptor 2
Type:Receptor Tyrosine Kinase
Mol. Mass.:151510.97
Organism:Homo sapiens (Human)
Description:P35968
Residue:1356
BDBM50210300
NameBDBM50210300
Synonyms:CHEMBL225311 | N-(3-(4-(6-((4-methylpiperazin-1-yl)methyl)-1,4-dihydroindeno-[1,2-c]pyrazol-3-yl)thiophen-2-yl)prop-2-ynyl)benzamide
TypeSmall organic molecule
Emp. Form.C30H29N5OS
Mol. Mass.507.649
SMILESCN1CCN(Cc2ccc-3c(Cc4c-3n[nH]c4-c3csc(c3)C#CCNC(=O)c3ccccc3)c2)CC1