Reaction Details
TargetVascular endothelial growth factor receptor 2
LigandBDBM50210271
Substrate/Competitorn/a
Meas. Tech.ChEMBL_434530 (CHEMBL914746)
IC50 5±n/a nM
Citation Dinges, JAlbert, DHArnold, LDAshworth, KLAkritopoulou-Zanze, IBousquet, PFBouska, JJCunha, GADavidsen, SKDiaz, GJDjuric, SWGasiecki, AFGintant, GAGracias, VJHarris, CMHouseman, KAHutchins, CWJohnson, EFLi, HMarcotte, PAMartin, RLMichaelides, MRNyein, MSowin, TJSu, ZTapang, PHXia, ZZhang, HQ 1,4-Dihydroindeno[1,2-c]pyrazoles with acetylenic side chains as novel and potent multitargeted receptor tyrosine kinase inhibitors with low affinity for the hERG ion channel. J Med Chem50:2011-29 (2007) 
 
Vascular endothelial growth factor receptor 2
Name:Vascular endothelial growth factor receptor 2
Type:Receptor Tyrosine Kinase
Mol. Mass.:151510.97
Organism:Homo sapiens (Human)
Description:P35968
Residue:1356
BDBM50210271
NameBDBM50210271
Synonyms:7-((1H-1,2,4-triazol-1-yl)methyl)-3-(5-(3-(2-methoxyethoxy)-prop-1-ynyl)thiophen-3-yl)-1,4-dihydroindeno[1,2-c]pyrazole | CHEMBL223971
TypeSmall organic molecule
Emp. Form.C23H21N5O2S
Mol. Mass.431.51
SMILESCOCCOCC#Cc1cc(cs1)-c1[nH]nc-2c1Cc1ccc(Cn3cncn3)cc-21