Reaction Details
TargetVascular endothelial growth factor receptor 2
LigandBDBM50210269
Substrate/Competitorn/a
Meas. Tech.ChEMBL_434530 (CHEMBL914746)
IC50 8±n/a nM
Citation Dinges, JAlbert, DHArnold, LDAshworth, KLAkritopoulou-Zanze, IBousquet, PFBouska, JJCunha, GADavidsen, SKDiaz, GJDjuric, SWGasiecki, AFGintant, GAGracias, VJHarris, CMHouseman, KAHutchins, CWJohnson, EFLi, HMarcotte, PAMartin, RLMichaelides, MRNyein, MSowin, TJSu, ZTapang, PHXia, ZZhang, HQ 1,4-Dihydroindeno[1,2-c]pyrazoles with acetylenic side chains as novel and potent multitargeted receptor tyrosine kinase inhibitors with low affinity for the hERG ion channel. J Med Chem50:2011-29 (2007) 
 
Vascular endothelial growth factor receptor 2
Name:Vascular endothelial growth factor receptor 2
Type:Receptor Tyrosine Kinase
Mol. Mass.:151510.97
Organism:Homo sapiens (Human)
Description:P35968
Residue:1356
BDBM50210269
NameBDBM50210269
Synonyms:4-(4-(6-((4-methylpiperazin-1-yl)methyl)-1,4-dihydroindeno-[1,2-c]pyrazol-3-yl)thiophen-2-yl)but-3-yn-1-ol | CHEMBL225639
TypeSmall organic molecule
Emp. Form.C24H26N4OS
Mol. Mass.418.554
SMILESCN1CCN(Cc2ccc-3c(Cc4c-3n[nH]c4-c3csc(c3)C#CCCO)c2)CC1