Reaction Details
TargetProthrombin
LigandBDBM50210424
Substrate/Competitorn/a
Meas. Tech.ChEMBL_455389 (CHEMBL886164)
IC50 1.6±n/a nM
Citation Hanessian, SErsmark, KWang, XDel Valle, JRBlomberg, NXue, YFjellström, O Structure-based organic synthesis of unnatural aeruginosin hybrids as potent inhibitors of thrombin. Bioorg Med Chem Lett17:3480-5 (2007) 
 
Prothrombin
Name:Prothrombin
Type:Protein
Mol. Mass.:70029.57
Organism:Homo sapiens (Human)
Description:P00734
Residue:622
BDBM50210424
NameBDBM50210424
Synonyms:(2S,3aS,7aS)-1-[3-chloro-2-((S)-(2S,3R)-2-hydroxy-3-phenyl-propionylamino)-4-methyl-pentanoyl]-octahydro-indole-2-carboxylic acid 4-carbamimidoyl-benzylamide | CHEMBL246703
TypeSmall organic molecule
Emp. Form.C32H42ClN5O4
Mol. Mass.596.16
SMILESCC(C)[C@H](Cl)[C@@H](NC(=O)[C@H](O)Cc1ccccc1)C(=O)N1[C@@H](C[C@@H]2CCCC[C@H]12)C(=O)NCc1ccc(cc1)C(N)=N