Reaction Details
TargetProthrombin
LigandBDBM50210428
Substrate/Competitorn/a
Meas. Tech.ChEMBL_455389 (CHEMBL886164)
IC50 11±n/a nM
Citation Hanessian, SErsmark, KWang, XDel Valle, JRBlomberg, NXue, YFjellström, O Structure-based organic synthesis of unnatural aeruginosin hybrids as potent inhibitors of thrombin. Bioorg Med Chem Lett17:3480-5 (2007) 
 
Prothrombin
Name:Prothrombin
Type:Protein
Mol. Mass.:70029.57
Organism:Homo sapiens (Human)
Description:P00734
Residue:622
BDBM50210428
NameBDBM50210428
Synonyms:(2S,3aR,5S,6S,7aS)-1-{(S)-3-chloro-2-[(S)-3-hydroxy-2-((R)-methoxy)-propionylamino]-4-methyl-pentanoyl}-5,6-dihydroxy-octahydro-indole-2-carboxylic acid [2-(1-carbamimidoyl-2,5-dihydro-1H-pyrrol-3-yl)-ethyl]-amide | CHEMBL394402
TypeSmall organic molecule
Emp. Form.C26H43ClN6O7
Mol. Mass.587.109
SMILESCO[C@H](CO)C(=O)N[C@H]([C@@H](Cl)C(C)C)C(=O)N1[C@H]2C[C@H](O)[C@@H](O)C[C@H]2C[C@H]1C(=O)NCCC1=CCN(C1)C(N)=N