Reaction Details
TargetProthrombin
LigandBDBM50210435
Substrate/Competitorn/a
Meas. Tech.ChEMBL_455389 (CHEMBL886164)
IC50 7±n/a nM
Citation Hanessian, SErsmark, KWang, XDel Valle, JRBlomberg, NXue, YFjellström, O Structure-based organic synthesis of unnatural aeruginosin hybrids as potent inhibitors of thrombin. Bioorg Med Chem Lett17:3480-5 (2007) 
 
Prothrombin
Name:Prothrombin
Type:Protein
Mol. Mass.:70029.57
Organism:Homo sapiens (Human)
Description:P00734
Residue:622
BDBM50210435
NameBDBM50210435
Synonyms:(S)-1-[(2R,3R)-2-((R)-2-hydroxy-3-phenyl-propionylamino)-3-methyl-pentanoyl]-pyrrolidine-2-carboxylic acid 4-carbamimidoyl-benzylamide | CHEMBL246295
TypeSmall organic molecule
Emp. Form.C28H37N5O4
Mol. Mass.507.6245
SMILESCC[C@@H](C)[C@@H](NC(=O)[C@H](O)Cc1ccccc1)C(=O)N1CCC[C@H]1C(=O)NCc1ccc(cc1)C(N)=N