Reaction Details
TargetcGMP-dependent protein kinase
LigandBDBM50210479
Substrate/Competitorn/a
Meas. Tech.ChEMBL_455393 (CHEMBL886170)
IC50 0.06±n/a nM
Citation Scribner, ADennis, RHong, JLee, SMcIntyre, DPerrey, DFeng, DFisher, MWyvratt, MLeavitt, PLiberator, PGurnett, ABrown, CMathew, JThompson, DSchmatz, DBiftu, T Synthesis and biological activity of imidazopyridine anticoccidial agents: part I. Eur J Med Chem42:1334-57 (2007) 
 
cGMP-dependent protein kinase
Name:cGMP-dependent protein kinase
Synonyms:n/a
Type:PROTEIN
Mol. Mass.:112911.27
Organism:Eimeria tenella
Description:ChEMBL_469577
Residue:1003
BDBM50210479
NameBDBM50210479
TypeSmall organic molecule
Emp. Form.C27H23F3N6
Mol. Mass.488.5069
SMILESCN(C)Cc1ccn2c(c(nc2c1)-c1ccc(F)cc1)-c1ccnc(NCc2c(F)cccc2F)n1