Reaction Details
TargetC-C chemokine receptor type 1
LigandBDBM50210983
Substrate/Competitorn/a
Meas. Tech.ChEMBL_444182 (CHEMBL892290)
IC50 14±n/a nM
Citation Xie, YFLake, KLigsay, KKomandla, MSircar, INagarajan, GLi, JXu, KParise, JSchneider, LHuang, DLiu, JDines, KSakurai, NBarbosa, MJack, R Structure-activity relationships of novel, highly potent, selective, and orally active CCR1 antagonists. Bioorg Med Chem Lett17:3367-72 (2007) 
 
C-C chemokine receptor type 1
Name:C-C chemokine receptor type 1
Type:Enzyme
Mol. Mass.:41180.69
Organism:Homo sapiens (Human)
Description:P32246
Residue:355
BDBM50210983
NameBDBM50210983
Synonyms:(R)-3-(2-(2-(4-(4-fluorobenzyl)-2-methylpiperazin-1-yl)-2-oxoethoxy)-5-bromophenylamino)-4-(methylamino)cyclobut-3-ene-1,2-dione | CHEMBL232253
TypeSmall organic molecule
Emp. Form.C25H26BrFN4O4
Mol. Mass.545.401
SMILESCNc1c(Nc2cc(Br)ccc2OCC(=O)N2CCN(Cc3ccc(F)cc3)C[C@H]2C)c(=O)c1=O