Reaction Details
TargetC-C chemokine receptor type 1
LigandBDBM50208999
Substrate/Competitorn/a
Meas. Tech.ChEMBL_444183 (CHEMBL892291)
IC50 18±n/a nM
Citation Xie, YFLake, KLigsay, KKomandla, MSircar, INagarajan, GLi, JXu, KParise, JSchneider, LHuang, DLiu, JDines, KSakurai, NBarbosa, MJack, R Structure-activity relationships of novel, highly potent, selective, and orally active CCR1 antagonists. Bioorg Med Chem Lett17:3367-72 (2007) 
 
C-C chemokine receptor type 1
Name:C-C chemokine receptor type 1
Type:Enzyme
Mol. Mass.:41180.69
Organism:Homo sapiens (Human)
Description:P32246
Residue:355
BDBM50208999
NameBDBM50208999
Synonyms:(R)-1-(2-(2-(4-(4-fluorobenzyl)-2-methylpiperazin-1-yl)-2-oxoethoxy)-5-chlorophenyl)urea BX-471 CHEMBL232656
TypeSmall organic molecule
Emp. Form.C21H24ClFN4O3
Mol. Mass.434.892
SMILESC[C@@H]1CN(Cc2ccc(F)cc2)CCN1C(=O)COc1ccc(Cl)cc1NC(N)=O