Reaction Details
TargetBeta-lactamase
LigandBDBM31774
Substrate/Competitorn/a
Meas. Tech.ChEMBL_434809 (CHEMBL917037)
IC50 35000±n/a nM
Citation Feng, BYSimeonov, AJadhav, ABabaoglu, KInglese, JShoichet, BKAustin, CP A high-throughput screen for aggregation-based inhibition in a large compound library. J Med Chem50:2385-90 (2007) 
 
Beta-lactamase
Name:Beta-lactamase
Type:Protien
Mol. Mass.:41561.62
Organism:Escherichia coli
Description:P00811
Residue:377
BDBM31774
NameBDBM31774
Synonyms:CHEMBL104 Clotrimazole Mycelex cid_2812
TypeSmall organic molecule
Emp. Form.C22H17ClN2
Mol. Mass.344.837
SMILESClc1ccccc1C(c1ccccc1)(c1ccccc1)n1ccnc1