Reaction Details
TargetGlutamate receptor 2
LigandBDBM50002370
Substrate/Competitorn/a
Meas. Tech.ChEMBL_435003 (CHEMBL920804)
Ki 0.017±n/a nM
Citation Vogensen, SBFrydenvang, KGreenwood, JRPostorino, GNielsen, BPickering, DSEbert, BBølcho, UEgebjerg, JGajhede, MKastrup, JSJohansen, TNClausen, RPKrogsgaard-Larsen, P A tetrazolyl-substituted subtype-selective AMPA receptor agonist. J Med Chem50:2408-14 (2007) 
 
Glutamate receptor 2
Name:Glutamate receptor 2
Type:PROTEIN
Mol. Mass.:98691.74
Organism:Rattus norvegicus
Description:ChEMBL_936441
Residue:883
BDBM50002370
NameBDBM50002370
Synonyms:(R,S)-alpha-amino-3-hydroxy-5-methyl-4-isooxazole-propionic acid 2-Amino-3-(3-hydroxy-5-methyl-isoxazol-4-yl)-propionic acid 2-amino-3-(3-hydroxy-5-methyl-4-isoxazolyl)-propionic acid 2-ammonio-3-(3-hydroxy-5-methylisoxazol-4-yl)propanoate CHEMBL13378
TypeSmall organic molecule
Emp. Form.C7H10N2O4
Mol. Mass.186.1653
SMILESCc1o[nH]c(=O)c1CC(N)C(O)=O