Reaction Details
TargetCyclin-dependent kinase 1
LigandBDBM50214119
Substrate/Competitorn/a
Meas. Tech.ChEMBL_456265 (CHEMBL888275)
IC50 7.4±n/a nM
Citation Lin, RConnolly, PJLu, YChiu, GLi, SYu, YHuang, SLi, XEmanuel, SLMiddleton, SAGruninger, RHAdams, MFuentes-Pesquera, ARGreenberger, LM Synthesis and evaluation of pyrazolo[3,4-b]pyridine CDK1 inhibitors as anti-tumor agents. Bioorg Med Chem Lett17:4297-302 (2007) 
 
Cyclin-dependent kinase 1
Name:Cyclin-dependent kinase 1
Type:Enzyme Subunit
Mol. Mass.:34101.08
Organism:Homo sapiens (Human)
Description:P06493
Residue:297
BDBM50214119
NameBDBM50214119
Synonyms:CHEMBL400568 | N-((5-(3-(4-(methoxymethyl)-1H-benzo[d]imidazol-2-yl)-1H-pyrazolo[3,4-b]pyridin-5-yl)pyridin-3-yl)methyl)propan-1-amine
TypeSmall organic molecule
Emp. Form.C24H25N7O
Mol. Mass.427.5016
SMILESCCCNCc1cncc(c1)-c1cnc2[nH]nc(-c3nc4cccc(COC)c4[nH]3)c2c1