Reaction Details
TargetPeroxisome proliferator-activated receptor alpha
LigandBDBM50214906
Substrate/Competitorn/a
Meas. Tech.ChEMBL_456357 (CHEMBL888368)
EC50 1±n/a nM
Citation Yamazaki, YAbe, KToma, TNishikawa, MOzawa, HOkuda, AAraki, TOda, SInoue, KShibuya, KStaels, BFruchart, JC Design and synthesis of highly potent and selective human peroxisome proliferator-activated receptor alpha agonists. Bioorg Med Chem Lett17:4689-93 (2007) 
 
Peroxisome proliferator-activated receptor alpha
Name:Peroxisome proliferator-activated receptor alpha
Type:Enzyme
Mol. Mass.:52222.08
Organism:Homo sapiens (Human)
Description:Q07869
Residue:468
BDBM50214906
NameBDBM50214906
Synonyms:2-(3-((benzo[d]oxazol-2-yl(3-(4-methoxyphenoxy)propyl)amino)methyl)phenoxy)butanoic acid | CHEMBL245866
TypeSmall organic molecule
Emp. Form.C28H30N2O6
Mol. Mass.490.5476
SMILESCCC(Oc1cccc(CN(CCCOc2ccc(OC)cc2)c2nc3ccccc3o2)c1)C(O)=O