Reaction Details
TargetMetabotropic glutamate receptor 5
LigandBDBM50215553
Substrate/Competitorn/a
Meas. Tech.ChEMBL_439646 (CHEMBL888761)
IC50 0.230000±n/a nM
Citation Siméon, FGBrown, AKZoghbi, SSPatterson, VMInnis, RBPike, VW Synthesis and simple 18F-labeling of 3-fluoro-5-(2-(2-(fluoromethyl)thiazol-4-yl)ethynyl)benzonitrile as a high affinity radioligand for imaging monkey brain metabotropic glutamate subtype-5 receptors with positron emission tomography. J Med Chem50:3256-66 (2007) 
 
Metabotropic glutamate receptor 5
Name:Metabotropic glutamate receptor 5
Type:Enzyme
Mol. Mass.:131900.14
Organism:Rattus norvegicus (Rat)
Description:P31424
Residue:1203
BDBM50215553
NameBDBM50215553
Synonyms:5-(2-(2-fluoromethyl)thiazole-4-yl)ethynyl)pyridine-3-carbonitrile | CHEMBL229962
TypeSmall organic molecule
Emp. Form.C12H6FN3S
Mol. Mass.243.26
SMILESFCc1nc(cs1)C#Cc1cncc(c1)C#N