Reaction Details
TargetKappa-type opioid receptor
LigandBDBM50215552
Substrate/Competitorn/a
Meas. Tech.ChEMBL_439697 (CHEMBL888808)
Ki>10000±n/a nM
Citation Siméon, FGBrown, AKZoghbi, SSPatterson, VMInnis, RBPike, VW Synthesis and simple 18F-labeling of 3-fluoro-5-(2-(2-(fluoromethyl)thiazol-4-yl)ethynyl)benzonitrile as a high affinity radioligand for imaging monkey brain metabotropic glutamate subtype-5 receptors with positron emission tomography. J Med Chem50:3256-66 (2007) 
 
Kappa-type opioid receptor
Name:Kappa-type opioid receptor
Type:G Protein-Coupled Receptor (GPCR)
Mol. Mass.:42648.76
Organism:Homo sapiens (Human)
Description:P41145
Residue:380
BDBM50215552
NameBDBM50215552
Synonyms:3-fluoro-5-(2-(2-(fluoromethyl)thiazol-4-yl)ethynyl)benzonitrile | CHEMBL229429
TypeSmall organic molecule
Emp. Form.C13H6F2N2S
Mol. Mass.260.262
SMILESFCc1nc(cs1)C#Cc1cc(F)cc(c1)C#N