Reaction Details
TargetMelanin-concentrating hormone receptor 1
LigandBDBM50215613
Substrate/Competitorn/a
Meas. Tech.ChEMBL_437192 (CHEMBL906590)
Ki 3.3±n/a nM
Citation Su, JMcKittrick, BATang, HBurnett, DAClader, JWGreenlee, WJHawes, BEO'Neill, KSpar, BWeig, BKowalski, TSorota, SLi, CLiu, T SAR study of bicyclo[4.1.0]heptanes as melanin-concentrating hormone receptor R1 antagonists: taming hERG. Bioorg Med Chem15:5369-85 (2007) 
 
Melanin-concentrating hormone receptor 1
Name:Melanin-concentrating hormone receptor 1
Type:G Protein-Coupled Receptor (GPCR)
Mol. Mass.:45976.27
Organism:Homo sapiens (Human)
Description:Membranes from CHO-K1 cells stably expressing human MCH1R were used in assays.
Residue:422
BDBM50215613
NameBDBM50215613
Synonyms:3-(2,6-dichloropyridin-4-yl)-1-((3R,6S)-6-(3-((dimethylamino)methyl)phenyl)bicyclo[4.1.0]heptan-3-yl)-1-((1-(methylsulfonyl)piperidin-4-yl)methyl)urea | CHEMBL229291
TypeSmall organic molecule
Emp. Form.C29H39Cl2N5O3S
Mol. Mass.608.623
SMILESCN(C)Cc1cccc(c1)[C@@]12CC1C[C@@H](CC2)N(CC1CCN(CC1)S(C)(=O)=O)C(=O)Nc1cc(Cl)nc(Cl)c1