Reaction Details
TargetMelanin-concentrating hormone receptor 1
LigandBDBM50215645
Substrate/Competitorn/a
Meas. Tech.ChEMBL_437192 (CHEMBL906590)
Ki 1.9±n/a nM
Citation Su, JMcKittrick, BATang, HBurnett, DAClader, JWGreenlee, WJHawes, BEO'Neill, KSpar, BWeig, BKowalski, TSorota, SLi, CLiu, T SAR study of bicyclo[4.1.0]heptanes as melanin-concentrating hormone receptor R1 antagonists: taming hERG. Bioorg Med Chem15:5369-85 (2007) 
 
Melanin-concentrating hormone receptor 1
Name:Melanin-concentrating hormone receptor 1
Type:G Protein-Coupled Receptor (GPCR)
Mol. Mass.:45976.27
Organism:Homo sapiens (Human)
Description:Membranes from CHO-K1 cells stably expressing human MCH1R were used in assays.
Residue:422
BDBM50215645
NameBDBM50215645
Synonyms:1-((3R,6S)-6-(3-cyanophenyl)bicyclo[4.1.0]heptan-3-yl)-3-(2,6-dichloropyridin-4-yl)-1-(2-(isopropylamino)ethyl)urea | CHEMBL374844
TypeSmall organic molecule
Emp. Form.C25H29Cl2N5O
Mol. Mass.486.437
SMILESCC(C)NCCN([C@@H]1CC[C@@]2(CC2C1)c1cccc(c1)C#N)C(=O)Nc1cc(Cl)nc(Cl)c1