Reaction Details
Target3-hydroxy-3-methylglutaryl-coenzyme A reductase
LigandBDBM50215698
Substrate/Competitorn/a
Meas. Tech.ChEMBL_456534 (CHEMBL922900)
IC50 1.2±n/a nM
Citation Pfefferkorn, JASong, YSun, KLMiller, SRTrivedi, BKChoi, CSorenson, RJBratton, LDUnangst, PCLarsen, SDPoel, TJCheng, XMLee, CErasga, NAuerbach, BAskew, VDillon, LHanselman, JCLin, ZLu, GRobertson, AOlsen, KMertz, TSekerke, CPavlovsky, AHarris, MSBainbridge, GCaspers, NChen, HEberstadt, M Design and synthesis of hepatoselective, pyrrole-based HMG-CoA reductase inhibitors. Bioorg Med Chem Lett17:4538-44 (2007) 
 
3-hydroxy-3-methylglutaryl-coenzyme A reductase
Name:3-hydroxy-3-methylglutaryl-coenzyme A reductase
Type:Enzyme
Mol. Mass.:97477.10
Organism:Homo sapiens (Human)
Description:P04035
Residue:888
BDBM50215698
NameBDBM50215698
Synonyms:CHEMBL251499 | sodium (3R,5R)-7-(5-((4-(dimethylcarbamoyl)benzyl)carbamoyl)-3-(4-fluorophenyl)-1-isopropyl-4-phenyl-1H-pyrrol-2-yl)-3,5-dihydroxyheptanoate
TypeSmall organic molecule
Emp. Form.C37H41FN3O6
Mol. Mass.642.7369
SMILESCC(C)n1c(CC[C@@H](O)C[C@@H](O)CC([O-])=O)c(c(c1C(=O)NCc1ccc(cc1)C(=O)N(C)C)-c1ccccc1)-c1ccc(F)cc1