Reaction Details
TargetAurora kinase A
LigandBDBM50215752
Substrate/Competitorn/a
Meas. Tech.ChEMBL_456543 (CHEMBL922909)
IC50>10000±n/a nM
Citation Lin, RChiu, GYu, YConnolly, PJLi, SLu, YAdams, MFuentes-Pesquera, AREmanuel, SLGreenberger, LM Design, synthesis, and evaluation of 3,4-disubstituted pyrazole analogues as anti-tumor CDK inhibitors. Bioorg Med Chem Lett17:4557-61 (2007) 
 
Aurora kinase A
Name:Aurora kinase A
Type:Serine/threonine-protein kinase
Mol. Mass.:45830.98
Organism:Homo sapiens (Human)
Description:O14965
Residue:403
BDBM50215752
NameBDBM50215752
Synonyms:6-(4-methylpiperazin-1-yl)-2-(4-(2-(pyridin-3-yl)vinyl)-1H-pyrazol-3-yl)-1H-benzo[d]imidazole | CHEMBL394465
TypeSmall organic molecule
Emp. Form.C22H23N7
Mol. Mass.385.4649
SMILESCN1CCN(CC1)c1ccc2nc([nH]c2c1)-c1n[nH]cc1C=Cc1cccnc1