Reaction Details
TargetHistamine H3 receptor
LigandBDBM50216246
Substrate/Competitorn/a
Meas. Tech.ChEMBL_456606 (CHEMBL923983)
Ki 4±n/a nM
Citation Keith, JMGomez, LABarbier, AJWilson, SJBoggs, JDLord, BMazur, CAluisio, LLovenberg, TWCarruthers, NI Pyrrolidino-tetrahydroisoquinolines bearing pendant heterocycles as potent dual H3 antagonist and serotonin transporter inhibitors. Bioorg Med Chem Lett17:4374-7 (2007) 
 
Histamine H3 receptor
Name:Histamine H3 receptor
Type:G Protein-Coupled Receptor (GPCR)
Mol. Mass.:48691.47
Organism:Homo sapiens (Human)
Description:Binding assays were using CHO cells stably expressing hH3R receptors.
Residue:445
BDBM50216246
NameBDBM50216246
Synonyms:(6S,10bR)-9-(3-morpholinopropoxy)-6-(1H-pyrazol-5-yl)-1,2,3,5,6,10b-hexahydropyrrolo[2,1-a]isoquinoline | CHEMBL397597
TypeSmall organic molecule
Emp. Form.C22H30N4O2
Mol. Mass.382.4992
SMILESC(COc1ccc2[C@@H](CN3CCC[C@@H]3c2c1)c1ccn[nH]1)CN1CCOCC1