Reaction Details
TargetHistamine H3 receptor
LigandBDBM50216248
Substrate/Competitorn/a
Meas. Tech.ChEMBL_456606 (CHEMBL923983)
Ki 1.6±n/a nM
Citation Keith, JMGomez, LABarbier, AJWilson, SJBoggs, JDLord, BMazur, CAluisio, LLovenberg, TWCarruthers, NI Pyrrolidino-tetrahydroisoquinolines bearing pendant heterocycles as potent dual H3 antagonist and serotonin transporter inhibitors. Bioorg Med Chem Lett17:4374-7 (2007) 
 
Histamine H3 receptor
Name:Histamine H3 receptor
Type:G Protein-Coupled Receptor (GPCR)
Mol. Mass.:48691.47
Organism:Homo sapiens (Human)
Description:Binding assays were using CHO cells stably expressing hH3R receptors.
Residue:445
BDBM50216248
NameBDBM50216248
Synonyms:(6R,10bR)-9-(3-morpholinopropoxy)-6-(pyridin-3-yl)-1,2,3,5,6,10b-hexahydropyrrolo[2,1-a]isoquinoline | CHEMBL439561
TypeSmall organic molecule
Emp. Form.C24H31N3O2
Mol. Mass.393.5218
SMILESC(COc1ccc2[C@@H](CN3CCC[C@@H]3c2c1)c1cccnc1)CN1CCOCC1