Reaction Details
TargetSodium-dependent serotonin transporter
LigandBDBM50216254
Substrate/Competitorn/a
Meas. Tech.ChEMBL_456605 (CHEMBL923982)
Ki 12.3±n/a nM
Citation Keith, JMGomez, LABarbier, AJWilson, SJBoggs, JDLord, BMazur, CAluisio, LLovenberg, TWCarruthers, NI Pyrrolidino-tetrahydroisoquinolines bearing pendant heterocycles as potent dual H3 antagonist and serotonin transporter inhibitors. Bioorg Med Chem Lett17:4374-7 (2007) 
 
Sodium-dependent serotonin transporter
Name:Sodium-dependent serotonin transporter
Type:Multi-pass membrane protein
Mol. Mass.:70322.51
Organism:Homo sapiens (Human)
Description:P31645
Residue:630
BDBM50216254
NameBDBM50216254
Synonyms:(6S,10bR)-6-(4-(1H-pyrazol-1-yl)phenyl)-9-(3-morpholinopropoxy)-1,2,3,5,6,10b-hexahydropyrrolo[2,1-a]isoquinoline | CHEMBL392196
TypeSmall organic molecule
Emp. Form.C28H34N4O2
Mol. Mass.458.5952
SMILESC(COc1ccc2[C@@H](CN3CCC[C@@H]3c2c1)c1ccc(cc1)-n1cccn1)CN1CCOCC1