Reaction Details
TargetSodium-dependent noradrenaline transporter
LigandBDBM50216245
Substrate/Competitorn/a
Meas. Tech.ChEMBL_456613 (CHEMBL922968)
Ki 460±n/a nM
Citation Keith, JMGomez, LABarbier, AJWilson, SJBoggs, JDLord, BMazur, CAluisio, LLovenberg, TWCarruthers, NI Pyrrolidino-tetrahydroisoquinolines bearing pendant heterocycles as potent dual H3 antagonist and serotonin transporter inhibitors. Bioorg Med Chem Lett17:4374-7 (2007) 
 
Sodium-dependent noradrenaline transporter
Name:Sodium-dependent noradrenaline transporter
Type:Multi-pass membrane protein
Mol. Mass.:69337.72
Organism:Homo sapiens (Human)
Description:P23975
Residue:617
BDBM50216245
NameBDBM50216245
Synonyms:(6R,10bR)-9-(3-(piperidin-1-yl)propoxy)-6-(pyridin-3-yl)-1,2,3,5,6,10b-hexahydropyrrolo[2,1-a]isoquinoline | CHEMBL247933
TypeSmall organic molecule
Emp. Form.C25H33N3O
Mol. Mass.391.549
SMILESC(COc1ccc2[C@@H](CN3CCC[C@@H]3c2c1)c1cccnc1)CN1CCCCC1