Reaction Details
TargetSodium-dependent serotonin transporter
LigandBDBM50216256
Substrate/Competitorn/a
Meas. Tech.ChEMBL_456604 (CHEMBL923981)
Ki 39±n/a nM
Citation Keith, JMGomez, LABarbier, AJWilson, SJBoggs, JDLord, BMazur, CAluisio, LLovenberg, TWCarruthers, NI Pyrrolidino-tetrahydroisoquinolines bearing pendant heterocycles as potent dual H3 antagonist and serotonin transporter inhibitors. Bioorg Med Chem Lett17:4374-7 (2007) 
 
Sodium-dependent serotonin transporter
Name:Sodium-dependent serotonin transporter
Type:Multi-pass membrane protein
Mol. Mass.:70168.43
Organism:Rattus norvegicus (rat)
Description:P31652
Residue:630
BDBM50216256
NameBDBM50216256
Synonyms:(6S,10bR)-6-(H-imidazo[1,2-a]pyridin-3-yl)-9-(3-morpholinopropoxy)-1,2,3,5,6,10b-hexahydropyrrolo[2,1-a]isoquinoline | CHEMBL245294
TypeSmall organic molecule
Emp. Form.C26H32N4O2
Mol. Mass.432.5579
SMILESC(COc1ccc2[C@@H](CN3CCC[C@@H]3c2c1)c1cnc2ccccn12)CN1CCOCC1