Reaction Details
TargetSodium-dependent serotonin transporter
LigandBDBM50216251
Substrate/Competitorn/a
Meas. Tech.ChEMBL_456604 (CHEMBL923981)
Ki 20±n/a nM
Citation Keith, JMGomez, LABarbier, AJWilson, SJBoggs, JDLord, BMazur, CAluisio, LLovenberg, TWCarruthers, NI Pyrrolidino-tetrahydroisoquinolines bearing pendant heterocycles as potent dual H3 antagonist and serotonin transporter inhibitors. Bioorg Med Chem Lett17:4374-7 (2007) 
 
Sodium-dependent serotonin transporter
Name:Sodium-dependent serotonin transporter
Type:Multi-pass membrane protein
Mol. Mass.:70168.43
Organism:Rattus norvegicus (rat)
Description:P31652
Residue:630
BDBM50216251
NameBDBM50216251
Synonyms:(6S,10bR)-9-(3-(piperidin-1-yl)propoxy)-6-(pyridin-4-yl)-1,2,3,5,6,10b-hexahydropyrrolo[2,1-a]isoquinoline | CHEMBL393669
TypeSmall organic molecule
Emp. Form.C25H33N3O
Mol. Mass.391.549
SMILESC(COc1ccc2[C@@H](CN3CCC[C@@H]3c2c1)c1ccncc1)CN1CCCCC1