Reaction Details
TargetGlucocorticoid receptor
LigandBDBM50216479
Substrate/Competitorn/a
Meas. Tech.ChEMBL_440116 (CHEMBL890428)
Ki 9.2±n/a nM
Citation Ray, NCClark, RDClark, DEWilliams, KHickin, HGCrackett, PHDyke, HJLockey, PMWong, MDevos, RWhite, ABelanoff, JK Discovery and optimization of novel, non-steroidal glucocorticoid receptor modulators. Bioorg Med Chem Lett17:4901-5 (2007) 
 
Glucocorticoid receptor
Name:Glucocorticoid receptor
Type:Enzyme
Mol. Mass.:85656.87
Organism:Homo sapiens (Human)
Description:P04150
Residue:777
BDBM50216479
NameBDBM50216479
Synonyms:5-benzyl-6-(4-(3-methoxyphenyl)piperidin-1-yl)pyrimidine-2,4(1H,3H)-dione | CHEMBL396020
TypeSmall organic molecule
Emp. Form.C23H25N3O3
Mol. Mass.391.4629
SMILESCOc1cccc(c1)C1CCN(CC1)c1[nH]c(=O)[nH]c(=O)c1Cc1ccccc1