Reaction Details
TargetGlucocorticoid receptor
LigandBDBM50216493
Substrate/Competitorn/a
Meas. Tech.ChEMBL_440116 (CHEMBL890428)
Ki 6.5±n/a nM
Citation Ray, NCClark, RDClark, DEWilliams, KHickin, HGCrackett, PHDyke, HJLockey, PMWong, MDevos, RWhite, ABelanoff, JK Discovery and optimization of novel, non-steroidal glucocorticoid receptor modulators. Bioorg Med Chem Lett17:4901-5 (2007) 
 
Glucocorticoid receptor
Name:Glucocorticoid receptor
Type:Enzyme
Mol. Mass.:85656.87
Organism:Homo sapiens (Human)
Description:P04150
Residue:777
BDBM50216493
NameBDBM50216493
Synonyms:5-benzyl-6-(3-phenylpiperidin-1-yl)pyrimidine-2,4(1H,3H)-dione | CHEMBL231502
TypeSmall organic molecule
Emp. Form.C22H23N3O2
Mol. Mass.361.4369
SMILESO=c1[nH]c(N2CCCC(C2)c2ccccc2)c(Cc2ccccc2)c(=O)[nH]1