Reaction Details
TargetGlucocorticoid receptor
LigandBDBM50216494
Substrate/Competitorn/a
Meas. Tech.ChEMBL_440116 (CHEMBL890428)
Ki 14±n/a nM
Citation Ray, NCClark, RDClark, DEWilliams, KHickin, HGCrackett, PHDyke, HJLockey, PMWong, MDevos, RWhite, ABelanoff, JK Discovery and optimization of novel, non-steroidal glucocorticoid receptor modulators. Bioorg Med Chem Lett17:4901-5 (2007) 
 
Glucocorticoid receptor
Name:Glucocorticoid receptor
Type:Enzyme
Mol. Mass.:85656.87
Organism:Homo sapiens (Human)
Description:P04150
Residue:777
BDBM50216494
NameBDBM50216494
Synonyms:5-(3-bromobenzyl)-6-(4-phenylpiperidin-1-yl)pyrimidine-2,4(1H,3H)-dione | CHEMBL231094
TypeSmall organic molecule
Emp. Form.C22H22BrN3O2
Mol. Mass.440.333
SMILESBrc1cccc(Cc2c([nH]c(=O)[nH]c2=O)N2CCC(CC2)c2ccccc2)c1