Reaction Details
TargetCannabinoid receptor 1
LigandBDBM50200841
Substrate/Competitorn/a
Meas. Tech.ChEMBL_440533 (CHEMBL889632)
IC50 0.3±n/a nM
Citation Liu, PLin, LSHamill, TGJewell, JPLanza, TJGibson, REKrause, SMRyan, CEng, WSanabria, STong, XWang, JLevorse, DAOwens, KAFong, TMShen, CPLao, JKumar, SYin, WPayack, JFSpringfield, SAHargreaves, RBurns, HDGoulet, MTHagmann, WK Discovery of N-{(1S,2S)-2-(3-cyanophenyl)- 3-[4-(2-[18F]fluoroethoxy)phenyl]-1-methylpropyl}- 2-methyl-2-[(5-methylpyridin-2-yl)oxy]propanamide, a cannabinoid-1 receptor positron emission tomography tracer suitable for clinical use. J Med Chem50:3427-30 (2007) 
 
Cannabinoid receptor 1
Name:Cannabinoid receptor 1
Type:G Protein-Coupled Receptor (GPCR)
Mol. Mass.:52868.96
Organism:Homo sapiens (Human)
Description:P21554
Residue:472
BDBM50200841
NameBDBM50200841
Synonyms:CHEMBL220360 MK-0634 N-[(1S,2S)-3-(4-chlorophenyl)-2-(3-cyanophenyl)-1-methylpropyl]-2-methyl-2-{[5-(trifluoromethyl)pyridin-2-yl]oxy}propanamide Taranbant
TypeSmall organic molecule
Emp. Form.C27H25ClF3N3O2
Mol. Mass.515.955
SMILESC[C@H](NC(=O)C(C)(C)Oc1ccc(cn1)C(F)(F)F)[C@@H](Cc1ccc(Cl)cc1)c1cccc(c1)C#N