Reaction Details
TargetCannabinoid receptor 1
LigandBDBM50217223
Substrate/Competitorn/a
Meas. Tech.ChEMBL_440533 (CHEMBL889632)
IC50 0.9±n/a nM
Citation Liu, PLin, LSHamill, TGJewell, JPLanza, TJGibson, REKrause, SMRyan, CEng, WSanabria, STong, XWang, JLevorse, DAOwens, KAFong, TMShen, CPLao, JKumar, SYin, WPayack, JFSpringfield, SAHargreaves, RBurns, HDGoulet, MTHagmann, WK Discovery of N-{(1S,2S)-2-(3-cyanophenyl)- 3-[4-(2-[18F]fluoroethoxy)phenyl]-1-methylpropyl}- 2-methyl-2-[(5-methylpyridin-2-yl)oxy]propanamide, a cannabinoid-1 receptor positron emission tomography tracer suitable for clinical use. J Med Chem50:3427-30 (2007) 
 
Cannabinoid receptor 1
Name:Cannabinoid receptor 1
Type:G Protein-Coupled Receptor (GPCR)
Mol. Mass.:52868.96
Organism:Homo sapiens (Human)
Description:P21554
Residue:472
BDBM50217223
NameBDBM50217223
Synonyms:CHEMBL226684 | N-[(1S,2S)-2-(3-cyano-5-fluorophenyl)-3-(4-methoxyphenyl)-1-methylpropyl]-2-methyl-2-{[5-(trifluoromethyl)pyridin-2-yl]oxy}propanamide
TypeSmall organic molecule
Emp. Form.C28H27F4N3O3
Mol. Mass.529.5259
SMILESCOc1ccc(C[C@H]([C@H](C)NC(=O)C(C)(C)Oc2ccc(cn2)C(F)(F)F)c2cc(F)cc(c2)C#N)cc1